{"text_format":"1","workbook":"xlsx","n_sheets":22,"sheets":["Contents","Key Assumptions >","Transport Demand","Technology Scenarios","Energy Demand","Results Tools >","Total Energy Demand","Energy Demand by Mode","Energy Demand Explorer","Energy Demand Tables >","Full Results","Shipping Summary","Aviation Summary","Ferries Summary","Rail Summary","Capacity Summary","Bus Summary","Car Summary","HGV Summary","Van Summary","Results_Backend","Data_Explorer_Backend"],"not_rendered":{"charts":23,"images":8,"macros":1,"external_links":5,"defined_names":35,"comments":0,"pivot_tables":2},"unopened":[],"bounds":{"document_bytes":16777216,"sheet_cells":100000,"rows_first":2000,"rows_last":500,"rows_between":2000,"halvings":0,"cell_chars":16384,"cell_head_chars":4096},"cells_cut":0,"cells_raw":0,"read":"whole","date_system":"1900"}

{"sheet":"Contents","index":0,"n_rows":35,"n_cols":4,"rows_kept":35,"cut":false,"hidden":false,"merged":[[13,1,15,1],[17,1,20,1],[22,1,24,1]]}
[]
[]
[]
[]
[]
[null,null,"Zero Emission Energy for Transport:","National Demand Forecasts for Electricity and Hydrogen - Excel Tool"]
[]
[]
{"$rows_left_out":28}
{"sheet":"Key Assumptions >","index":1,"n_rows":20,"n_cols":3,"rows_kept":20,"cut":false,"hidden":false,"merged":[[18,1,18,4],[19,1,19,4],[13,1,13,4],[9,2,9,4],[8,2,8,4],[14,1,14,4],[15,1,15,4],[16,1,16,4],[17,1,17,4]]}
[]
[]
[null,null,"Key Assumptions: Overview and Section Tab >"]
[]
[]
[]
[]
[null,"Overarching Energy Demand Forecast Parameters"]
{"$rows_left_out":13}
{"sheet":"Transport Demand","index":2,"n_rows":51,"n_cols":6,"rows_kept":51,"cut":false,"hidden":false,"merged":[[7,1,7,5],[36,1,36,5],[47,1,47,5],[32,2,32,5],[21,2,22,2],[10,2,10,5],[27,3,29,3],[14,1,14,5],[34,2,34,3],[27,2,29,2],[21,4,21,5],[23,2,26,2],[23,4,23,5],[30,2,31,2],[23,3,26,3],[35,2,35,3],[50,2,50,5],[44,2,44,5],[37,4,37,5],[38,4,43,5],[38,2,43,3],[37,2,37,3]]}
[]
[]
[null,null,"Key Assumptions: Transport Demand"]
[]
[]
[]
[]
[null,"Road Demand"]
{"$rows_left_out":44}
{"sheet":"Technology Scenarios","index":3,"n_rows":53,"n_cols":6,"rows_kept":53,"cut":false,"hidden":false,"merged":[[7,1,7,5],[36,2,36,3],[37,2,37,3],[33,4,33,5],[34,4,34,5],[35,4,35,5],[36,4,36,5],[37,4,37,5],[15,2,15,5],[27,2,27,5],[26,2,26,5],[25,2,25,5],[24,2,24,5],[23,2,23,5],[22,2,22,5],[21,2,21,5],[20,1,20,5],[32,3,32,5],[31,1,31,5],[33,2,33,3],[34,2,34,3],[35,2,35,3],[51,2,51,5],[52,2,52,5],[44,1,44,5],[45,1,45,5],[46,2,46,5],[47,2,47,5],[48,2,48,5],[49,2,49,5],[50,2,50,5],[39,2,39,5],[40,2,40,5],[38,2,38,3],[38,4,38,5]]}
[]
[]
[null,null,"Key Assumptions: Technology Transition Scenarios"]
[]
[]
[]
[]
[null,"Road"]
{"$rows_left_out":46}
{"sheet":"Energy Demand","index":4,"n_rows":83,"n_cols":8,"rows_kept":83,"cut":false,"hidden":false,"merged":[[10,7,15,7],[55,4,58,4],[79,4,80,4],[81,4,82,4],[14,4,15,4],[16,4,18,4],[69,4,71,4]]}
[]
[]
[]
[null,null,"Key Assumptions: Energy Demand Analysis"]
[]
[]
[]
[]
{"$rows_left_out":76}
{"sheet":"Results Tools >","index":5,"n_rows":22,"n_cols":22,"rows_kept":22,"cut":false,"hidden":false,"merged":[[21,1,21,2]]}
[null,null,null,null,null,null,null,"Hydrogen Lookup",null,null,2022,2023,2024,2025,2026,2027,2028,2029,2030,2035,2040,2045]
[null,null,null,null,null,null,null,{"$f":"'Results Tools >'!B22","v":"Scenario 1: Low Electric + High Hydrogen"},"Forecast Hydrogen Transport Demand","TWh",{"$f":"INDEX('Capacity Summary'!D12:D17,MATCH($H$2,'Capacity Summary'!$B$12:$B$17,0))","v":9.9008934662275106E-3},{"$f":"INDEX('Capacity Summary'!E12:E17,MATCH($H$2,'Capacity Summary'!$B$12:$B$17,0))","v":1.5160701070678132E-2},{"$f":"INDEX('Capacity Summary'!F12:F17,MATCH($H$2,'Capacity Summary'!$B$12:$B$17,0))","v":2.1488046040716944E-2},{"$f":"INDEX('Capacity Summary'!G12:G17,MATCH($H$2,'Capacity Summary'!$B$12:$B$17,0))","v":3.06355500166695E-2},{"$f":"INDEX('Capacity Summary'!H12:H17,MATCH($H$2,'Capacity Summary'!$B$12:$B$17,0))","v":0.11966504208151264},{"$f":"INDEX('Capacity Summary'!I12:I17,MATCH($H$2,'Capacity Summary'!$B$12:$B$17,0))","v":0.22346609488373512},{"$f":"INDEX('Capacity Summary'!J12:J17,MATCH($H$2,'Capacity Summary'!$B$12:$B$17,0))","v":0.34857259740214697},{"$f":"INDEX('Capacity Summary'!K12:K17,MATCH($H$2,'Capacity Summary'!$B$12:$B$17,0))","v":0.4724318920295939},{"$f":"INDEX('Capacity Summary'!L12:L17,MATCH($H$2,'Capacity Summary'!$B$12:$B$17,0))","v":1.1739109898105964},{"$f":"INDEX('Capacity Summary'!M12:M17,MATCH($H$2,'Capacity Summary'!$B$12:$B$17,0))","v":5.5727418145973253},{"$f":"INDEX('Capacity Summary'!N12:N17,MATCH($H$2,'Capacity Summary'!$B$12:$B$17,0))","v":10.204185882427369},{"$f":"INDEX('Capacity Summary'!O12:O17,MATCH($H$2,'Capacity Summary'!$B$12:$B$17,0))","v":14.858005726010553}]
[null,null,null,null,null,null,null,{"$f":"H2","v":"Scenario 1: Low Electric + High Hydrogen"},"Estimated Excess Hydrogen Production ","TWh",{"$f":"INDEX('Capacity Summary'!D20:D25,MATCH($H$3,'Capacity Summary'!$B$20:$B$25,0))","v":1.1356375680722341},{"$f":"INDEX('Capacity Summary'!E20:E25,MATCH($H$3,'Capacity Summary'!$B$20:$B$25,0))","v":1.7031469912370141},{"$f":"INDEX('Capacity Summary'!F20:F25,MATCH($H$3,'Capacity Summary'!$B$20:$B$25,0))","v":4.2742811847285145},{"$f":"INDEX('Capacity Summary'!G20:G25,MATCH($H$3,'Capacity Summary'!$B$20:$B$25,0))","v":7.1289798345987148},{"$f":"INDEX('Capacity Summary'!H20:H25,MATCH($H$3,'Capacity Summary'!$B$20:$B$25,0))","v":10.190181111764641},{"$f":"INDEX('Capacity Summary'!I20:I25,MATCH($H$3,'Capacity Summary'!$B$20:$B$25,0))","v":14.095764674347034},{"$f":"INDEX('Capacity Summary'!J20:J25,MATCH($H$3,'Capacity Summary'!$B$20:$B$25,0))","v":18.266427402597852},{"$f":"INDEX('Capacity Summary'!K20:K25,MATCH($H$3,'Capacity Summary'!$B$20:$B$25,0))","v":23.011106569508865},{"$f":"INDEX('Capacity Summary'!L20:L25,MATCH($H$3,'Capacity Summary'!$B$20:$B$25,0))","v":26.326089010189403},{"$f":"INDEX('Capacity Summary'!M20:M25,MATCH($H$3,'Capacity Summary'!$B$20:$B$25,0))","v":43.427258185402678},{"$f":"INDEX('Capacity Summary'!N20:N25,MATCH($H$3,'Capacity Summary'!$B$20:$B$25,0))","v":65.495814117572635},{"$f":"INDEX('Capacity Summary'!O20:O25,MATCH($H$3,'Capacity Summary'!$B$20:$B$25,0))","v":92.64199427398944}]
[null,null,null,null,null,null,null,{"$f":"H3","v":"Scenario 1: Low Electric + High Hydrogen"},"Forecast Hydrogen Transport Demand","%",{"$f":"INDEX('Capacity Summary'!D$28:D$33,MATCH($H$4,'Capacity Summary'!$B$28:$B$33,0))","v":8.64300396595203E-3},{"$f":"INDEX('Capacity Summary'!E$28:E$33,MATCH($H$4,'Capacity Summary'!$B$28:$B$33,0))","v":8.823042077124886E-3},{"$f":"INDEX('Capacity Summary'!F$28:F$33,MATCH($H$4,'Capacity Summary'!$B$28:$B$33,0))","v":5.0021416157099161E-3},{"$f":"INDEX('Capacity Summary'!G$28:G$33,MATCH($H$4,'Capacity Summary'!$B$28:$B$33,0))","v":4.2789379555917646E-3},{"$f":"INDEX('Capacity Summary'!H$28:H$33,MATCH($H$4,'Capacity Summary'!$B$28:$B$33,0))","v":1.160686981123097E-2},{"$f":"INDEX('Capacity Summary'!I$28:I$33,MATCH($H$4,'Capacity Summary'!$B$28:$B$33,0))","v":1.5606012535528103E-2},{"$f":"INDEX('Capacity Summary'!J$28:J$33,MATCH($H$4,'Capacity Summary'!$B$28:$B$33,0))","v":1.8725361128237819E-2},{"$f":"INDEX('Capacity Summary'!K$28:K$33,MATCH($H$4,'Capacity Summary'!$B$28:$B$33,0))","v":2.0117576948778266E-2},{"$f":"INDEX('Capacity Summary'!L$28:L$33,MATCH($H$4,'Capacity Summary'!$B$28:$B$33,0))","v":4.268767235674896E-2},{"$f":"INDEX('Capacity Summary'!M$28:M$33,MATCH($H$4,'Capacity Summary'!$B$28:$B$33,0))","v":0.11372942478770051},{"$f":"INDEX('Capacity Summary'!N$28:N$33,MATCH($H$4,'Capacity Summary'!$B$28:$B$33,0))","v":0.13479769989996523},{"$f":"INDEX('Capacity Summary'!O$28:O$33,MATCH($H$4,'Capacity Summary'!$B$28:$B$33,0))","v":0.13821400675358655}]
[null,null,null,null,null,null,null,"Scenario 1: Low Electric + High Hydrogen","Estimated Excess Hydrogen Production ","%",{"$f":"INDEX('Capacity Summary'!D$36:D$41,MATCH($H$5,'Capacity Summary'!$B$20:$B$25,0))","v":0.99135699603404792},{"$f":"INDEX('Capacity Summary'!E$36:E$41,MATCH($H$5,'Capacity Summary'!$B$20:$B$25,0))","v":0.99117695792287508},{"$f":"INDEX('Capacity Summary'!F$36:F$41,MATCH($H$5,'Capacity Summary'!$B$20:$B$25,0))","v":0.99499785838429011},{"$f":"INDEX('Capacity Summary'!G$36:G$41,MATCH($H$5,'Capacity Summary'!$B$20:$B$25,0))","v":0.99572106204440824},{"$f":"INDEX('Capacity Summary'!H$36:H$41,MATCH($H$5,'Capacity Summary'!$B$20:$B$25,0))","v":0.98839313018876906},{"$f":"INDEX('Capacity Summary'!I$36:I$41,MATCH($H$5,'Capacity Summary'!$B$20:$B$25,0))","v":0.98439398746447193},{"$f":"INDEX('Capacity Summary'!J$36:J$41,MATCH($H$5,'Capacity Summary'!$B$20:$B$25,0))","v":0.98127463887176214},{"$f":"INDEX('Capacity Summary'!K$36:K$41,MATCH($H$5,'Capacity Summary'!$B$20:$B$25,0))","v":0.97988242305122175},{"$f":"INDEX('Capacity Summary'!L$36:L$41,MATCH($H$5,'Capacity Summary'!$B$20:$B$25,0))","v":0.95731232764325103},{"$f":"INDEX('Capacity Summary'!M$36:M$41,MATCH($H$5,'Capacity Summary'!$B$20:$B$25,0))","v":0.88627057521229946},{"$f":"INDEX('Capacity Summary'!N$36:N$41,MATCH($H$5,'Capacity Summary'!$B$20:$B$25,0))","v":0.86520230010003474},{"$f":"INDEX('Capacity Summary'!O$36:O$41,MATCH($H$5,'Capacity Summary'!$B$20:$B$25,0))","v":0.86178599324641347}]
[null,null,"Results Tools - Overview and Section Tab >"]
[null,null,null,null,null,null,null,"Electricity Lookup",null,null,2022,2023,2024,2025,2026,2027,2028,2029,2030,2035,2040,2045]
[null,null,null,null,null,null,null,{"$f":"'Results Tools >'!B22","v":"Scenario 1: Low Electric + High Hydrogen"},"Forecast Electricity Transport Demand","TWh",{"$f":"INDEX('Capacity Summary'!D$46:D$51,MATCH($H8,'Capacity Summary'!$B$46:$B$51,0))","v":0.57769486005134063},{"$f":"INDEX('Capacity Summary'!E$46:E$51,MATCH($H$8,'Capacity Summary'!$B$46:$B$51,0))","v":0.73203892615995392},{"$f":"INDEX('Capacity Summary'!F$46:F$51,MATCH($H$8,'Capacity Summary'!$B$46:$B$51,0))","v":0.92676450165872115},{"$f":"INDEX('Capacity Summary'!G$46:G$51,MATCH($H$8,'Capacity Summary'!$B$46:$B$51,0))","v":1.1673315031891065},{"$f":"INDEX('Capacity Summary'!H$46:H$51,MATCH($H$8,'Capacity Summary'!$B$46:$B$51,0))","v":1.3756946634569984},{"$f":"INDEX('Capacity Summary'!I$46:I$51,MATCH($H$8,'Capacity Summary'!$B$46:$B$51,0))","v":1.6515205371142101},{"$f":"INDEX('Capacity Summary'!J$46:J$51,MATCH($H$8,'Capacity Summary'!$B$46:$B$51,0))","v":1.9541437248301459},{"$f":"INDEX('Capacity Summary'!K$46:K$51,MATCH($H$8,'Capacity Summary'!$B$46:$B$51,0))","v":2.3111418582632157},{"$f":"INDEX('Capacity Summary'!L$46:L$51,MATCH($H$8,'Capacity Summary'!$B$46:$B$51,0))","v":2.8169158230331881},{"$f":"INDEX('Capacity Summary'!M$46:M$51,MATCH($H$8,'Capacity Summary'!$B$46:$B$51,0))","v":5.683640768720057},{"$f":"INDEX('Capacity Summary'!N$46:N$51,MATCH($H$8,'Capacity Summary'!$B$46:$B$51,0))","v":9.0459741239941529},{"$f":"INDEX('Capacity Summary'!O$46:O$51,MATCH($H$8,'Capacity Summary'!$B$46:$B$51,0))","v":11.20471969178371}]
{"$rows_left_out":15}
{"sheet":"Total Energy Demand","index":6,"n_rows":87,"n_cols":8,"rows_kept":87,"cut":false,"hidden":false,"merged":[]}
[]
[]
[]
[]
[]
[null,"Total Energy Demand Excel Tool "]
[]
[]
{"$rows_left_out":80}
{"sheet":"Energy Demand by Mode","index":7,"n_rows":12,"n_cols":2,"rows_kept":12,"cut":false,"hidden":false,"merged":[]}
[]
[]
[]
[]
[]
[null,"Energy Demand by Mode Excel Tool "]
[]
[]
{"$rows_left_out":5}
{"sheet":"Energy Demand Explorer","index":8,"n_rows":44,"n_cols":17,"rows_kept":44,"cut":false,"hidden":false,"merged":[[14,0,15,0],[16,1,17,1],[30,3,36,3],[37,3,43,3]]}
[]
[]
[]
[]
[]
[null,"Energy Demand Explorer Excel Tool "]
[]
[]
{"$rows_left_out":37}
{"sheet":"Energy Demand Tables >","index":9,"n_rows":6,"n_cols":3,"rows_kept":6,"cut":false,"hidden":false,"merged":[]}
[]
[]
[]
[]
[]
[null,null,"Energy Demand Tables - Section Tab >"]

{"sheet":"Full Results","index":10,"n_rows":241,"n_cols":14,"rows_kept":241,"cut":false,"hidden":false,"merged":[[220,0,220,12],[226,0,226,12],[117,0,117,13],[182,0,182,12],[196,0,196,12],[202,0,202,12],[208,0,208,12],[214,0,214,12],[130,0,130,12],[143,0,143,12],[156,0,156,12],[169,0,169,12],[12,0,12,13],[116,0,116,13],[195,0,195,13],[108,0,108,13],[13,0,13,13],[22,0,22,13],[31,0,31,13],[40,0,40,13],[49,0,49,13],[58,0,58,13],[68,0,68,13],[76,0,76,13],[84,0,84,13],[92,0,92,13],[100,0,100,13],[67,0,67,13]]}
[]
[]
[null,null,"Full Results Tables"]
[]
[]
[]
[]
["Units","MWh",2022,2023,2024,2025,2026,2027,2028,2029,2030,2035,2040,2045]
{"$rows_left_out":234}
{"sheet":"Shipping Summary","index":11,"n_rows":157,"n_cols":19,"rows_kept":157,"cut":false,"hidden":true,"merged":[[105,1,108,1],[9,1,12,1],[13,1,16,1],[17,1,20,1],[21,1,24,1],[25,1,28,1],[29,1,32,1],[85,1,88,1],[89,1,92,1],[93,1,96,1],[97,1,100,1],[101,1,104,1]]}
[null,0]
[null,null,"ZEEfT - ZEEfT - Shipping"]
[]
[]
[null,null,"Summary Tables for Zero Emission Shipping"]
[]
[null,null,"Summary Tables"]
[]
{"$rows_left_out":150}
{"sheet":"Aviation Summary","index":12,"n_rows":155,"n_cols":18,"rows_kept":155,"cut":false,"hidden":true,"merged":[[44,1,46,1],[9,1,11,1],[12,1,14,1],[15,1,17,1],[18,1,20,1],[21,1,23,1],[24,1,26,1],[29,1,31,1],[32,1,34,1],[35,1,37,1],[38,1,40,1],[41,1,43,1],[97,1,100,1],[50,1,53,1],[54,1,57,1],[58,1,61,1],[62,1,65,1],[66,1,69,1],[70,1,73,1],[77,1,80,1],[81,1,84,1],[85,1,88,1],[89,1,92,1],[93,1,96,1],[151,1,154,1],[104,1,107,1],[108,1,111,1],[112,1,115,1],[116,1,119,1],[120,1,123,1],[124,1,127,1],[131,1,134,1],[135,1,138,1],[139,1,142,1],[143,1,146,1],[147,1,150,1]]}
[null,0]
[null,null,"Scotland ATMs Analysis - Scotland ATMs Analysis"]
[]
[]
[null,null,"Summary Tables for Zero Emission Aircraft"]
[]
[null,null,"Summary Tables"]
[]
{"$rows_left_out":148}
{"sheet":"Ferries Summary","index":13,"n_rows":83,"n_cols":16,"rows_kept":83,"cut":false,"hidden":true,"merged":[[68,15,73,15],[77,15,82,15],[59,15,64,15],[32,15,37,15],[41,15,46,15],[50,15,55,15],[24,1,26,1],[9,1,11,1],[12,1,14,1],[15,1,17,1],[18,1,20,1],[21,1,23,1]]}
["OK"]
[]
[]
[]
[]
[]
[]
[]
{"$rows_left_out":76}
{"sheet":"Rail Summary","index":14,"n_rows":300,"n_cols":16,"rows_kept":300,"cut":false,"hidden":true,"merged":[[24,1,26,1],[9,1,11,1],[12,1,14,1],[15,1,17,1],[18,1,20,1],[21,1,23,1],[79,15,84,15],[88,15,93,15],[97,15,102,15],[106,15,111,15],[34,15,39,15],[43,15,48,15],[52,15,57,15],[61,15,66,15],[70,15,75,15]]}
[]
[]
[]
[]
[]
[]
[]
[]
{"$rows_left_out":293}
{"sheet":"Capacity Summary","index":15,"n_rows":91,"n_cols":15,"rows_kept":91,"cut":false,"hidden":true,"merged":[]}
[]
[]
[]
[]
[]
[]
[null,"Hydrogen"]
[]
{"$rows_left_out":84}
{"sheet":"Bus Summary","index":16,"n_rows":71,"n_cols":16,"rows_kept":71,"cut":false,"hidden":true,"merged":[[46,1,48,1],[24,1,26,1],[9,1,11,1],[12,1,14,1],[15,1,17,1],[18,1,20,1],[21,1,23,1],[31,1,33,1],[34,1,36,1],[37,1,39,1],[40,1,42,1],[43,1,45,1],[68,1,70,1],[53,1,55,1],[56,1,58,1],[59,1,61,1],[62,1,64,1],[65,1,67,1]]}
[]
[]
[null,null,{"$f":"MID(CELL(\"filename\",B1),FIND(\"]\",CELL(\"filename\",B1))+1,99)","v":"Bus Summary"}]
[]
[]
[]
[null,"Bus + Coach","Summary of total fuel usage split by fuel type"]
[]
{"$rows_left_out":64}
{"sheet":"Car Summary","index":17,"n_rows":62,"n_cols":16,"rows_kept":62,"cut":false,"hidden":true,"merged":[[24,1,26,1],[9,1,11,1],[12,1,14,1],[15,1,17,1],[18,1,20,1],[21,1,23,1]]}
[]
[]
[]
[]
[]
[]
[]
[]
{"$rows_left_out":55}
{"sheet":"HGV Summary","index":18,"n_rows":59,"n_cols":16,"rows_kept":59,"cut":false,"hidden":true,"merged":[[24,1,26,1],[9,1,11,1],[12,1,14,1],[15,1,17,1],[18,1,20,1],[21,1,23,1]]}
[]
[]
[]
[]
[]
[]
[]
[]
{"$rows_left_out":52}
{"sheet":"Van Summary","index":19,"n_rows":60,"n_cols":16,"rows_kept":60,"cut":false,"hidden":true,"merged":[[24,1,26,1],[9,1,11,1],[12,1,14,1],[15,1,17,1],[18,1,20,1],[21,1,23,1]]}
[]
[]
[]
[]
[]
[]
[]
[]
{"$rows_left_out":53}
{"sheet":"Results_Backend","index":20,"n_rows":73,"n_cols":26,"rows_kept":73,"cut":false,"hidden":true,"merged":[]}
["Year","Scenario","Electricity",null,null,null,"Year","Scenario","Hydrogen "]
[2022,"Scenario 1: Low Electric + High Hydrogen",{"$f":"N8","v":577694860.05134058},null,null,null,2022,"Scenario 1: Low Electric + High Hydrogen",{"$f":"N9","v":9900893.4662275091}]
[2023,"Scenario 1: Low Electric + High Hydrogen",{"$f":"O8","v":732038926.15995395},null,null,null,2023,"Scenario 1: Low Electric + High Hydrogen",{"$f":"O9","v":15160701.070678132}]
[2024,"Scenario 1: Low Electric + High Hydrogen",{"$f":"P8","v":926764501.65872121},null,null,null,2024,"Scenario 1: Low Electric + High Hydrogen",{"$f":"P9","v":21488046.040716946}]
[2025,"Scenario 1: Low Electric + High Hydrogen",{"$f":"Q8","v":1167331503.1891065},null,null,null,2025,"Scenario 1: Low Electric + High Hydrogen",{"$f":"Q9","v":30635550.016669501}]
[2026,"Scenario 1: Low Electric + High Hydrogen",{"$f":"R8","v":1375694663.4569983},null,null,null,2026,"Scenario 1: Low Electric + High Hydrogen",{"$f":"R9","v":119665042.08151264}]
[2027,"Scenario 1: Low Electric + High Hydrogen",{"$f":"S8","v":1651520537.1142101},null,null,null,2027,"Scenario 1: Low Electric + High Hydrogen",{"$f":"S9","v":223466094.88373512},null,null,null,null,2022,2023,2024,2025,2026,2027,2028,2029,2030,2035,2040,2045,"Units"]
[2028,"Scenario 1: Low Electric + High Hydrogen",{"$f":"T8","v":1954143724.8301458},null,null,null,2028,"Scenario 1: Low Electric + High Hydrogen",{"$f":"T9","v":348572597.40214694},null,null,"Scenario 1: Low Electric + High Hydrogen","Electricity",{"$f":"SUM(SUM('Shipping Summary'!H87:H88)+'Aviation Summary'!G31+'Ferries Summary'!E11+'Rail Summary'!E12+'Bus Summary'!E12+'Car Summary'!E11+'HGV Summary'!E11+'Van Summary'!E11)","v":577694860.05134058},{"$f":"SUM(SUM('Shipping Summary'!I87:I88)+'Aviation Summary'!H31+'Ferries Summary'!F11+'Rail Summary'!F12+'Bus Summary'!F12+'Car Summary'!F11+'HGV Summary'!F11+'Van Summary'!F11)","v":732038926.15995395},{"$f":"SUM(SUM('Shipping Summary'!J87:J88)+'Aviation Summary'!I31+'Ferries Summary'!G11+'Rail Summary'!G12+'Bus Summary'!G12+'Car Summary'!G11+'HGV Summary'!G11+'Van Summary'!G11)","v":926764501.65872121},{"$f":"SUM(SUM('Shipping Summary'!K87:K88)+'Aviation Summary'!J31+'Ferries Summary'!H11+'Rail Summary'!H12+'Bus Summary'!H12+'Car Summary'!H11+'HGV Summary'!H11+'Van Summary'!H11)","v":1167331503.1891065},{"$f":"SUM(SUM('Shipping Summary'!L87:L88)+'Aviation Summary'!K31+'Ferries Summary'!I11+'Rail Summary'!I12+'Bus Summary'!I12+'Car Summary'!I11+'HGV Summary'!I11+'Van Summary'!I11)","v":1375694663.4569983},{"$f":"SUM(SUM('Shipping Summary'!M87:M88)+'Aviation Summary'!L31+'Ferries Summary'!J11+'Rail Summary'!J12+'Bus Summary'!J12+'Car Summary'!J11+'HGV Summary'!J11+'Van Summary'!J11)","v":1651520537.1142101},{"$f":"SUM(SUM('Shipping Summary'!N87:N88)+'Aviation Summary'!M31+'Ferries Summary'!K11+'Rail Summary'!K12+'Bus Summary'!K12+'Car Summary'!K11+'HGV Summary'!K11+'Van Summary'!K11)","v":1954143724.8301458},{"$f":"SUM(SUM('Shipping Summary'!O87:O88)+'Aviation Summary'!N31+'Ferries Summary'!L11+'Rail Summary'!L12+'Bus Summary'!L12+'Car Summary'!L11+'HGV Summary'!L11+'Van Summary'!L11)","v":2311141858.263216},{"$f":"SUM(SUM('Shipping Summary'!P87:P88)+'Aviation Summary'!O31+'Ferries Summary'!M11+'Rail Summary'!M12+'Bus Summary'!M12+'Car Summary'!M11+'HGV Summary'!M11+'Van Summary'!M11)","v":2816915823.0331879},{"$f":"SUM(SUM('Shipping Summary'!Q87:Q88)+'Aviation Summary'!P31+'Ferries Summary'!N11+'Rail Summary'!N12+'Bus Summary'!N12+'Car Summary'!N11+'HGV Summary'!N11+'Van Summary'!N11)","v":5683640768.7200565},{"$f":"SUM(SUM('Shipping Summary'!R87:R88)+'Aviation Summary'!Q31+'Ferries Summary'!O11+'Rail Summary'!O12+'Bus Summary'!O12+'Car Summary'!O11+'HGV Summary'!O11+'Van Summary'!O11)","v":9045974123.9941521},{"$f":"SUM(SUM('Shipping Summary'!S87:S88)+'Aviation Summary'!R31+'Ferries Summary'!P11+'Rail Summary'!P12+'Bus Summary'!P12+'Car Summary'!P11+'HGV Summary'!P11+'Van Summary'!P11)","v":11204719691.783709},"kWh"]
{"$rows_left_out":66}
{"sheet":"Data_Explorer_Backend","index":21,"n_rows":311,"n_cols":58,"rows_kept":311,"cut":false,"hidden":true,"merged":[[287,0,298,0],[152,0,163,0],[164,0,175,0],[176,0,187,0],[188,0,199,0],[200,0,211,0],[212,0,223,0],[227,0,238,0],[239,0,250,0],[251,0,262,0],[263,0,274,0],[275,0,286,0],[137,0,148,0],[2,0,13,0],[14,0,25,0],[26,0,37,0],[38,0,49,0],[50,0,61,0],[62,0,73,0],[77,0,88,0],[89,0,100,0],[101,0,112,0],[113,0,124,0],[125,0,136,0]]}
["Aviation"]
[null,null,"Hydrogen","Electricity","LH2 Narrow Body","LH2 Regional","LH2 Wide Body","Elec Regional","Elec Small Turbo","Elec Large Turbo",null,null,null,null,null,null,null,null,null,null,null,null,null,null,null,2022,2023,2024,2025,2026,2027,2028,2029,2030,2035,2040,2045,null,null,null,"Scenario 1: Low Electric + High Hydrogen",2022,2023,2024,2025,2026,2027,2028,2029,2030,2035,2040,2045,null,null,"Aviation","Scenario 1: Low Electric + High Hydrogen","kWh"]
["Scenario 1: Low Electric + High Hydrogen",2022,{"$f":"SUM(E3:G3)","v":0},{"$f":"SUM(H3:J3)","v":0},{"$f":"TRANSPOSE(Z3:AK5)","v":0},0,0,{"$f":"TRANSPOSE(Z7:AK9)","v":0},0,0,null,null,null,null,null,null,null,null,null,null,null,null,null,"Scenario 1: Low Electric + High Hydrogen","LH2 Narrow Body",{"$f":"'Aviation Summary'!G79","v":0},{"$f":"'Aviation Summary'!H79","v":0},{"$f":"'Aviation Summary'!I79","v":0},{"$f":"'Aviation Summary'!J79","v":0},{"$f":"'Aviation Summary'!K79","v":0},{"$f":"'Aviation Summary'!L79","v":0},{"$f":"'Aviation Summary'!M79","v":0},{"$f":"'Aviation Summary'!N79","v":0},{"$f":"'Aviation Summary'!O79","v":0},{"$f":"'Aviation Summary'!P79","v":302754244.28891188},{"$f":"'Aviation Summary'!Q79","v":876468155.54863679},{"$f":"'Aviation Summary'!R79","v":1571044703.9760454},null,null,null,"Aviation",{"$f":"Z6","v":0},{"$f":"AA6","v":0},0,0,0,0,0,0,5633868.8765566358,359247189.66916054,1085026126.7121325,1969437720.1607757,null,null,"Maritime","Scenario 2: Medium Electric + Low Hydrogen","MWh"]
[null,2023,{"$f":"SUM(E4:G4)","v":0},0,0,0,0,0,0,0,null,null,null,null,null,null,null,null,null,null,null,null,null,null,"LH2 Regional",{"$f":"'Aviation Summary'!G80","v":0},{"$f":"'Aviation Summary'!H80","v":0},{"$f":"'Aviation Summary'!I80","v":0},{"$f":"'Aviation Summary'!J80","v":0},{"$f":"'Aviation Summary'!K80","v":0},{"$f":"'Aviation Summary'!L80","v":0},{"$f":"'Aviation Summary'!M80","v":0},{"$f":"'Aviation Summary'!N80","v":0},{"$f":"'Aviation Summary'!O80","v":5633868.8765566358},{"$f":"'Aviation Summary'!P80","v":35665278.004839048},{"$f":"'Aviation Summary'!Q80","v":68584681.923228741},{"$f":"'Aviation Summary'!R80","v":108682648.45030077},null,null,null,"Maritime",{"$f":"Z80","v":0},{"$f":"AA80","v":0},0,0,0,0,0,0,525064397.76854563,3181784732.3975406,5906432013.3077726,8714751357.6408463,null,null,"Road","Scenario 3: Medium Electric + High Hydrogen","GWh"]
[null,2024,0,0,0,0,0,0,0,0,null,null,null,null,null,null,null,null,null,null,null,null,null,null,"LH2 Wide Body",{"$f":"'Aviation Summary'!G81","v":0},{"$f":"'Aviation Summary'!H81","v":0},{"$f":"'Aviation Summary'!I81","v":0},{"$f":"'Aviation Summary'!J81","v":0},{"$f":"'Aviation Summary'!K81","v":0},{"$f":"'Aviation Summary'!L81","v":0},{"$f":"'Aviation Summary'!M81","v":0},{"$f":"'Aviation Summary'!N81","v":0},{"$f":"'Aviation Summary'!O81","v":0},{"$f":"'Aviation Summary'!P81","v":20827667.375409603},{"$f":"'Aviation Summary'!Q81","v":139973289.2402668},{"$f":"'Aviation Summary'!R81","v":289710367.73442966},null,null,null,"Rail",{"$f":"Z232","v":0},{"$f":"AA232","v":0},0,0,0,0,16052500.940000001,21612602.814000003,44836177.400000006,128745668,128745668,128745668,null,null,"Rail","Scenario 4: High Electric + Low Hydrogen","TWh"]
[null,2025,0,0,0,0,0,0,0,0,null,null,null,null,null,null,null,null,null,null,null,null,null,null,"Total Hydrogen",{"$f":"SUM(Z3:Z5)","v":0},{"$f":"SUM(AA3:AA5)","v":0},0,0,0,0,0,0,5633868.8765566358,359247189.66916054,1085026126.7121325,1969437720.1607757,null,null,null,"Road",{"$f":"Z158","v":9900893.4662275091},{"$f":"AA158","v":15160701.07067813},21488046.040716942,30635550.016669497,119665042.08151264,223466094.88373509,332520096.46214688,450819289.21559381,598376545.76549423,1902964224.5306239,3083982074.4074659,4045070980.2089343,null,null,null,"Scenario 5: High Electric + High Hydrogen"]
[null,2026,0,0,0,0,0,0,0,0,null,null,null,null,null,null,null,null,null,null,null,null,null,null,"Elec Regional",{"$f":"'Aviation Summary'!G133","v":0},{"$f":"'Aviation Summary'!H133","v":0},{"$f":"'Aviation Summary'!I133","v":0},{"$f":"'Aviation Summary'!J133","v":0},{"$f":"'Aviation Summary'!K133","v":0},{"$f":"'Aviation Summary'!L133","v":0},{"$f":"'Aviation Summary'!M133","v":0},{"$f":"'Aviation Summary'!N133","v":0},{"$f":"'Aviation Summary'!O133","v":0},{"$f":"'Aviation Summary'!P133","v":3.895051762917524E-9},{"$f":"'Aviation Summary'!Q133","v":0},{"$f":"'Aviation Summary'!R133","v":0},null,null,null,null,null,null,null,null,null,null,null,null,null,null,null,null,null,null,null,"Scenario 6: Medium Electric + Medium Hydrogen"]
[null,2027,0,0,0,0,0,0,0,0,null,null,null,null,null,null,null,null,null,null,null,null,null,null,"Elec Small Turbo",{"$f":"'Aviation Summary'!G134","v":0},{"$f":"'Aviation Summary'!H134","v":0},{"$f":"'Aviation Summary'!I134","v":0},{"$f":"'Aviation Summary'!J134","v":0},{"$f":"'Aviation Summary'!K134","v":0},{"$f":"'Aviation Summary'!L134","v":0},{"$f":"'Aviation Summary'!M134","v":0},{"$f":"'Aviation Summary'!N134","v":0},{"$f":"'Aviation Summary'!O134","v":0},{"$f":"'Aviation Summary'!P134","v":0},{"$f":"'Aviation Summary'!Q134","v":1620667.3225140932},{"$f":"'Aviation Summary'!R134","v":10972891.069436731}]
{"$rows_left_out":303}